viruses TREE
type: Ontology
version info: 1.0
comment: The Viruses Tree Taxonomy created with OntoLearn Reloaded (see http://ontolearn.org)

rna virus
type: Class
subclass of: virus

dna virus
type: Class
subclass of: virus

retrovirus
type: Class
subclass of: rna virus
comment: a retrovirus is an rna virus that is duplicated in a host cell using the reverse transcriptase enzyme to produce dna from its rna genome .

enveloped virus
type: Class
subclass of: virus

phage
type: Class
subclass of: virus
comment: a phage is a virus that is parasitic in bacteria .

herpesvirus
type: Class
subclass of: virus
comment: a herpesvirus is a virus . .

double-stranded dna virus
type: Class
subclass of: dna virus

arbovirus
type: Class
subclass of: virus

t-lymphotropic virus
type: Class
subclass of: virus

bacteriophage
type: Class
subclass of: virus

enterovirus
type: Class
subclass of: virus
comment: a enterovirus is a small virus that infects the gastrointestinal tract and can spread to other areas , especially the nervous system .

plant virus
type: Class
subclass of: virus

contagious virus
type: Class
subclass of: virus

parvoviridae
type: Class
subclass of: dna virus
comment: genomeinterestingly enough , parvoviridae is the only family of dna viruses that infect humans that is single stranded .

parainfluenza virus
type: Class
subclass of: virus
comment: a parainfluenza virus is a virus that causes upper respiratory infection

paramyxovirus
type: Class
subclass of: virus
comment: a paramyxovirus is a group of viruses including those causing mumps and measles .

reoviridae
type: Class
subclass of: arbovirus
comment: a reoviridae is a family of arboviruses carried by arthropods .

diarrhea virus
type: Class
subclass of: virus

double-stranded rna virus
type: Class
subclass of: rna virus

single-stranded minus-sense rna virus
type: Class
subclass of: rna virus

hantavirus
type: Class
subclass of: virus
comment: hantavirus is a virus that is found in the urine , saliva , or droppings of infected deer mice and some other wild rodents (

bunyaviridae
type: Class
subclass of: enveloped virus
comment: bunyaviridae is a family of enveloped viruses .

gb virus
type: Class
subclass of: virus

arenavirus
type: Class
subclass of: rna virus
comment: a arenavirus is any of several rna viruses , of the genus '' arenavirus '' , most of which cause severe diseases transmitted by rodents .

coronavirus
type: Class
subclass of: rna virus
comment: coronavirus is an rna virus that has three major proteins in the viral envelope ( ) with a fourth protein ( ) associated with the nucleocapsid .

hepadnavirus
type: Class
subclass of: animal dna virus
comment: a hepadnavirus is a group of animal dna viruses including viruses of ducks and woodchucks and squirrels and others as well as the virus causing hepatitis b in humans .

bacteriophage virus
type: Class
subclass of: virus

strand rna virus
type: Class
subclass of: rna virus

single-stranded rna virus
type: Class
subclass of: rna virus

human papillomavirus
type: Class
subclass of: dna virus
comment: human papillomavirus ( ) is a small dna virus that infects squamous epithelia performing a life cycle closely related to the differentiation program of the target cells 1 .

caudovirales
type: Class
subclass of: bacteriophage virus
comment: caudovirales is an order of bacteriophage virus that most of includes \ understands to ( ) .

animal dna virus
type: Class
subclass of: dna virus

parvovirus
type: Class
subclass of: contagious virus
comment: parvovirus is a contagious virus which travels from dog to dog .

poxviridae
type: Class
subclass of: dna virus
comment: poxviridae is a large family of complex dna viruses that infect both invertebrate and vertebrate hosts ( ) .

satellite virus
type: Class
subclass of: virus

simian t-lymphotropic virus
type: Class
subclass of: t-lymphotropic virus

orthomyxoviridae
type: Class
subclass of: single-stranded minus-sense rna virus
comment: orthomyxoviridae is a family of single-stranded minus-sense rna viruses with a segmented genome .

filamentous virus
type: Class
subclass of: virus

reassortant virus
type: Class
subclass of: virus

hepadnaviridae
type: Class
subclass of: hepadnavirus
comment: hepadnaviridae is a family of hepadnaviruses comprised by two genera , avihepadnavirus and the orthohepadnavirus .

fuselloviridae
type: Class
subclass of: virus
comment: fuselloviridae is a family of virus that includes\ understands a single sort , fusellovirus , that infects to bends sulfolobus .

immunodeficiency virus
type: Class
subclass of: virus

helper virus
type: Class
subclass of: virus

endogenous retrovirus
type: Class
subclass of: retrovirus
comment: an endogenous retrovirus is a special kind of retrovirus which invades the germline and thus becomes inherited by the organism 's progeny and .

nairobi sheep disease virus
type: Class
subclass of: virus

peste-des-petits-ruminants virus
type: Class
subclass of: virusa virus
comment: peste-des-petits-ruminants virus is a virusa virus ( ) is a sub-microscopic particle (

leishmaniavirus
type: Class
subclass of: double-stranded rna virus
comment: leishmaniavirus is a double-stranded rna virus with a genome approximately 5.3 kilobases in length that encodes two large open reading frames on the .

hendra virus
type: Class
subclass of: paramyxovirus
comment: hendra virus is a paramyxovirus with a negative-sense rna genome .

t-phages
type: Class
subclass of: bacteriophage
comment: a t-phages is a bacteriophages capable of infecting susceptible bacterial cells .

diarrhea virus 2
type: Class
subclass of: diarrhea virus

bacteriophage prd1
type: Class
subclass of: double-stranded dna virus
comment: bacteriophage prd1 is a double-stranded dna virus infecting gram-negative hosts .

herpesvirus 8
type: Class
subclass of: herpesvirus

mosquito-borne arbovirus
type: Class
subclass of: arbovirus

viral gennus iin whcih teh virion
type: Class
subclass of: virion

positive-stranded rna virus
type: Class
subclass of: rna virus

rhinovirus
type: Class
subclass of: virus
comment: rhinovirus was the virus most frequently detected ( ) , followed by rsv ( ) , parainfluenza viruses ( ) , with the other viruses being detected in less than 10 % of the respiratory tract secretions .

vertebrate virus
type: Class
subclass of: virus

defective virus
type: Class
subclass of: virus

chikungunya virus
type: Class
subclass of: rna virus
comment: chikungunya virus is a heat sensitive rna virus ( ) .

temperate lambdoid bacteriophage
type: Class
subclass of: bacteriophage

provirus
type: Class
subclass of: virus

herpesviridae
type: Class
subclass of: dna virus
comment: herpesviridae is a family of dna viruses that infect humans and other animals .

myoviridae
type: Class
subclass of: caudovirales
comment: myoviridae is a subclass of caudovirales ( ) ) ) .

hepacivirus
type: Class
subclass of: flaviviridae
comment: hepacivirus is a subclass of flaviviridae ( ) ) ) .

bacteriophage pf1
type: Class
subclass of: single-stranded phage
comment: bacteriophage pf1 is a filamentous and single-stranded phage whose rod-like structure ismade up of several thousands of unit coat proteins stacked helically .

hepevirus
type: Class
subclass of: viral gennus iin whcih teh virion
comment: hepevirus is a fairli isolated viral gennus iin whcih teh virions aer teh hepevirus is eksemplified bi its olny known species , teh '' hepatitis e.

metapneumovirus
type: Class
subclass of: single-stranded rna virus
comment: metapneumovirus is a negative single-stranded rna virus that in the paramyxovirus family , metapneumovirus is closely related to respiratory .

coronaviridae
type: Class
subclass of: virus
comment: coronaviridae is a family of viruses which are the causative agents of human upper respiratory infections including com - mon colds , as well as severe illnesses .

gb virus a
type: Class
subclass of: gb virus

staphylococcus phage
type: Class
subclass of: phage

border disease virus
type: Class
subclass of: virus

pseudocowpox virus
type: Class
subclass of: virus

maus elberfeld virus
type: Class
subclass of: virus

hantaan virus
type: Class
subclass of: enveloped virus
comment: hantaan virus is an enveloped virus with core particle composed of three single - stranded rna segments of negative polarity , designated according to size as .

influenza a virus
type: Class
subclass of: strand rna virus
comment: influenza a virus is a negative strand rna virus with a segmented genome coding for 10 different structural and nonstructural proteins .

lipothrixviridae
type: Class
subclass of: caudovirales
comment: lipothrixviridae is a subclass of caudovirales ( ) ) ) .

sindbis virus
type: Class
subclass of: enveloped virus
comment: sindbis virus is an enveloped virus with an 11.5 kb genome of single stranded rna .

tobacco necrosis satellite virus
type: Class
subclass of: satellite virus

crinivirus
type: Class
subclass of: virus
comment: crinivirus is the only virus containing a protein with sequence homolog to hsp70 , called hsp70 homolog .

leukemia virus
type: Class
subclass of: virus

distemper virus
type: Class
subclass of: virus

bunyamwera virus
type: Class
subclass of: stranded rna virus
comment: bunyamwera virus is a segmented negative stranded rna virus and the prototypic member of the bunyaviridae family .

rabies virus
type: Class
subclass of: rna virus
comment: rabies virus is an rna virus of the genus lyssavirus in the family sense genome rna of rabies virus is transcribed into five monocistronic mrnas that are .

hepatitis virus
type: Class
subclass of: virus

plum american line pattern virus
type: Class
subclass of: virus

influenzavirus c
type: Class
subclass of: orthomyxoviridae
comment: influenzavirus c is a subclass of orthomyxoviridae ( ) ) ) .

hepatitis e virus
type: Class
subclass of: strand rna virus
comment: hepatitis e virus is a non-enveloped single strand rna virus .

sars virus
type: Class
subclass of: virus

lactate dehydrogenase-elevating virus
type: Class
subclass of: virus

sarcoma virus
type: Class
subclass of: replication-competent virus
comment: sarcoma virus is a replication-competent virus bearing the v-src oncogene .

simian foamy virus
type: Class
subclass of: retrovirus
comment: simian foamy virus is a retrovirus and , to date , no person or animal has developed any disease or health conditions after having become in - fected with sfv .

potyvirus
type: Class
subclass of: rna virus
comment: potyvirus is a group of single stranded rna viruses with rod - shaped , self assemble in an ordered manner , and accumulates to high levels in infected tissues .

marburgvirus
type: Class
subclass of: ebolavirus
comment: marburgvirus is ebolavirus which has 5 distinct species yet shares high structural homology with .

bk virus
type: Class
subclass of: polyomavirus
comment: bk virus is a human polyomavirus that , after primary infection , enters latency in the host , most likely in the urogenital tract .

porcine epidemic diarrhea virus
type: Class
subclass of: diarrhea virus

echovirus 9
type: Class
subclass of: echovirus

parainfluenza virus 4
type: Class
subclass of: parainfluenza virus

hepatitis delta virus
type: Class
subclass of: rna virus
comment: hepatitis delta virus ( ) is a defected rna virus and requires its encoded large antigen ( ) to interact with helper viral proteins ( ) during assembly .

yellow fever virus
type: Class
subclass of: enveloped virus
comment: yellow fever virus ( ) is an enveloped virus with a positive sense , single stranded rna genome of 10,862 bases coding for a single orf of 10,233 bp .

tymoviridae
type: Class
subclass of: monopartite single-stranded positive sense rna plant virus
comment: tymoviridae are monopartite single-stranded positive sense rna plant viruses , belonging to group iv of the baltimore classification of viruses .

infectious pancreatic necrosis virus
type: Class
subclass of: bi-segmented double-stranded rna virus
comment: infectious pancreatic necrosis virus is a bi-segmented double-stranded rna virus of the family birnaviridae .

enterovirus c
type: Class
subclass of: enterovirus

simian t-lymphotropic virus 2
type: Class
subclass of: simian t-lymphotropic virus

diarrhea virus 1
type: Class
subclass of: diarrhea virus

thogotovirus
type: Class
subclass of: orthomyxoviridae
comment: thogotovirus is a subclass of orthomyxoviridae ( ) ) ) .

rna phage
type: Class
subclass of: phage

tobacco mosaic satellite virus
type: Class
subclass of: satellite virus

african swine fever virus
type: Class
subclass of: dna virus
comment: african swine fever virus is a double stranded dna virus and the only member of the asfarviridae family ( ) , which shows .

herpesvirus 5
type: Class
subclass of: herpesvirus

virion
type: Class
subclass of: virus

chicken anemia virus
type: Class
subclass of: dna virus
comment: chicken anemia virus ( ) is a small dna virus with a circular , covalently linked , single negative-strand genome .

semliki forest virus
type: Class
subclass of: alphavirus
comment: semliki forest virus is an alphavirus and it has four non-structuralproteins ( ) like all the alphaviruses .

jaagsiekte sheep retrovirus
type: Class
subclass of: retrovirus
comment: jaagsiekte sheep retrovirus is a subclass of retrovirus ( ) ) ) .

human t-lymphotropic virus 2
type: Class
subclass of: retrovirus
comment: human t-lymphotropic virus 2 is a subclass of retrovirus ( ) ) ) .

yaba monkey tumor virus
type: Class
subclass of: virus

bacteriophage ike
type: Class
subclass of: virus
comment: bacteriophage ike is a virus that has been shown to have a degree of specificity for coliform bacteria carryingconjugative plasmids of the n group such as rm98 .

siphoviridae
type: Class
subclass of: double-stranded dna virus
comment: siphoviridae are a family of double-stranded dna viruses infecting only bacteria that are characterized by a long non-contractile tail and an isometric capsid or a prolate capsid .

monkeypox virus
type: Class
subclass of: double-stranded dna virus
comment: monkeypox virus is a double-stranded dna virus and one of the human pathogenic orthopoxviruses that include variola ( ) , cowpox ( ) , and vaccinia ( ) viruses .

hepatitis a virus
type: Class
subclass of: rna virus
comment: hepatitis a virus is a rna virus ( ) which is found primarily in feces and causes a transient viremia .

self-replicating parvovirus
type: Class
subclass of: parvovirus

nipah virus
type: Class
subclass of: rna virus
comment: nipah virus is a single stranded rna virus , belonging to the family paramyxoviridae , in the subfamily paramyxovirinae , in the genus .

infectious bronchitis virus
type: Class
subclass of: coronavirus
comment: infectious bronchitis virus is a coronavirus of limited structural complexity that causes an acute , highly contagious respiratory disease in poultry .

ranavirus
type: Class
subclass of: dna virus
comment: ranavirus is a group of nucleocytoplasmic large dna viruses in the iridoviridae family .

morbillivirus
type: Class
subclass of: single-stranded rna virus
comment: morbillivirus is a single-stranded rna virus in the family paramyxoviridae .

ilarvirus
type: Class
subclass of: plum american line pattern virus
comment: a third pollen-borne ilarvirus is plum american line pattern virus , but this is very rare in our production blocks .

single-stranded dna virus
type: Class
subclass of: dna virus

ebolavirus
type: Class
subclass of: hemorrhagic fever virus
comment: ebolavirus is a hemorrhagic fever virus associated with high mortal - ity .

human papillomavirus 16
type: Class
subclass of: prevalent virus
comment: human papillomavirus 16 is the most prevalent virus to infect the uterine cervix , and it is closely associated with the entire range of intraepithelial and invasive .

ascoviridae
type: Class
subclass of: enveloped virus
comment: ascoviridae is a family of enveloped viruses that has only lepidopterous insects as hosts , me - chanically vectored by endoparasitic wasps .

puumala virus
type: Class
subclass of: hantavirus
comment: puumala virus is a member of hantavirus originally found in europe , and its natural reservoir is clethrionomys glareolus .

rotavirus
type: Class
subclass of: contagious virus
comment: rotavirus is a contagious virus and , among children , is the leading cause of severe across the world , rotavirus is thought to be responsible for more than 125 .

vesicular exanthema of swine virus
type: Class
subclass of: virus
comment: vesicular exanthema of swine virus is a virus different from those causing foot - and-mouth disease and swine vesicular disease but it produces a disease in .

potexvirus
type: Class
subclass of: rna virus
comment: potexvirus is one of the major rna viruses that infect plants .

canarypox virus
type: Class
subclass of: avipoxvirus
comment: canarypox virus is an avipoxvirus and etiologic agent of canarypox , a disease of wild and captive birds that can cause significant losses .

pseudomonas phage
type: Class
subclass of: phage

porcine respiratory and reproductive syndrome virus
type: Class
subclass of: virus

echovirus 6
type: Class
subclass of: enterovirus
comment: echovirus 6 is a species of enterovirus that has caused outbreak of aseptic meningitis in children and adults .

infectious hematopoietic necrosis virus
type: Class
subclass of: virus

jc virus
type: Class
subclass of: dna virus
comment: jc virus is a human dna virus that specifically infects oligodendroglial cells , range restriction of jc virus is controlled at the level of viral gene transcription .

archaeal virus
type: Class
subclass of: virus

betaherpesvirinae
type: Class
subclass of: herpesviridae
comment: betaherpesvirinae is a subclass of herpesviridae (

dsdna virus
type: Class
subclass of: virus

bacteriophage p22
type: Class
subclass of: temperate lambdoid bacteriophage
comment: bacteriophage p22 is a temperate lambdoid bacteriophage that , like , undergoes both a lytic and a lysogenic life cycle .

orthohepadnavirus
type: Class
subclass of: hepadnaviridae
comment: orthohepadnavirus is a subclass of hepadnaviridae ( ) ) ) orthohepadnavirus is an example of hepadnaviridae .

oncogenic virus
type: Class
subclass of: virus
comment: an oncogenic virus is a virus that is capable of causing cancer .

aleutian mink disease virus
type: Class
subclass of: self-replicating parvovirus
comment: aleutian mink disease virus is a kind of self-replicating parvovirus .

herpesvirus 1
type: Class
subclass of: herpesvirus

infectious bursal disease virus
type: Class
subclass of: icosahedral polyploid dsrna virus
comment: infectious bursal disease virus is an icosahedral polyploid dsrna virus .

cowpox virus
type: Class
subclass of: orthopox virus
comment: cowpox virus is an orthopox virus causing localized skin efflorescences in mammals .

herpesvirus 6
type: Class
subclass of: herpesvirus

orthopox virus
type: Class
subclass of: virus

mumps virus
type: Class
subclass of: paramyxovirus
comment: mumps virus is a paramyxovirus in the same group as parainfluenza and mumps virus is rapidly inactivated by formalin , ether , chloro - form , heat , and .

poxvirus vector
type: Class
subclass of: vector

sin nombre virus
type: Class
subclass of: enveloped virus
comment: sin nombre virus is an enveloped viruses consisting of three single stranded rna sequences designated large ( ) 6652 nucleotides , medium ( ) 3696 .

lumpy skin disease virus
type: Class
subclass of: capripoxvirus
comment: lumpy skin disease virus is a capripoxvirus in the family poxviridae .

echovirus
type: Class
subclass of: rna virus
comment: a echovirus is an rna virus of the '' enterovirus '' genus of the '' picornaviridae '' family , found in the gastrointestinal tract .

icosahedral polyploid dsrna virus
type: Class
subclass of: virus

avian leukosis virus
type: Class
subclass of: retrovirus
comment: avian leukosis virus is a retrovirus that makes a dna copy of its rna genome and integrates this dna copy into the genome of its host .

bluetongue virus
type: Class
subclass of: orbivirus
comment: bluetongue virus is an orbivirus that belongs to the reoviridae family of segmented double-stranded ( ) rna , icosahedral viruses with two or three layers of .

human papillomavirus 11
type: Class
subclass of: human papillomavirus

simbu virus
type: Class
subclass of: virus

mycobacteriophages
type: Class
subclass of: bacteriophage
comment: a mycobacteriophages is a bacteriophages . .

parainfluenza virus 1
type: Class
subclass of: parainfluenza virus

family bunyaviridae
type: Class
subclass of: bunyaviridae

enveloped dsrna virus
type: Class
subclass of: virus

stranded rna virus
type: Class
subclass of: rna virus

flaviviridae
type: Class
subclass of: arbovirus
comment: a flaviviridae is a family of arboviruses carried by arthropods .

lymphocytic choriomeningitis virus
type: Class
subclass of: arenavirus
comment: lymphocytic choriomeningitis virus is an arenavirus asymptomatically shed by chronically viremic mice and variably symptomatic golden .

ephemeral fever virus
type: Class
subclass of: virus

ectromelia virus
type: Class
subclass of: dna virus
comment: ectromelia virus is a large dna virus , family poxviridae , genus orthopoxvirus .

bacteriophage m13
type: Class
subclass of: filamentous virus
comment: bacteriophage m13 is a filamentous virus belongs to the virus family of inoviridae which encapsulate their circular single stranded dna inside the proteinaceous .

giardiavirus
type: Class
subclass of: nonenveloped virus
comment: giardiavirus is a small , nonenveloped virus comprising a monopartite double - stranded rna genome , a major protein of 100 kda , and a less abundant polypeptide .

uukuniemi virus
type: Class
subclass of: virus

influenza b virus
type: Class
subclass of: virus

seoul virus
type: Class
subclass of: hantavirus
comment: seoul virus is a hantavirus that causes hemorrhagic fever with renal syndrome ( ) .

bacteriophage t3
type: Class
subclass of: dna virus
comment: bacteriophage t3 is a relatively small dna virus that infects escherichia coli , shigella , .

capripoxvirus
type: Class
subclass of: poxvirus vector
comment: capripoxvirus is therefore an ideal poxvirus vector for the development of recombinant multivalent vaccines to enable delivery of immunogenic genes from other .

enterovirus d
type: Class
subclass of: enterovirus

myxoma virus
type: Class
subclass of: poxviridae
comment: myxoma virus is a member of the poxviridae and causes disease in european rabbits .

dependovirus
type: Class
subclass of: parvoviridae
comment: dependovirus is a subclass of parvoviridae (

orf virus
type: Class
subclass of: dsdna virus
comment: orf virus is a dsdna virus belonging to the parapoxvirus genus of the chordopoxvirinae subfamily and poxviridae family .

mink enteritis virus
type: Class
subclass of: parvoviridae
comment: mink enteritis virus is a subclass of parvoviridae ( ) ) ) .

simian t-lymphotropic virus 1
type: Class
subclass of: simian t-lymphotropic virus

alfalfa mosaic virus
type: Class
subclass of: plant virus
comment: alfalfa mosaic virus is a plant virus with a multi - partite genome ( ) which is composed of at least four different nucleoproteins .

rift valley fever virus
type: Class
subclass of: family bunyaviridae
comment: rift valley fever virus ( ) is a member of the family bunyaviridae and as such is an enveloped virus that has a negative stranded rna genome consisting of three fragments , aptly named s ( ) , m ( ) and l ( ) .

herpesvirus 2
type: Class
subclass of: herpesvirus

enterovirus a
type: Class
subclass of: enterovirus

bacillus phage
type: Class
subclass of: phage

avipoxvirus
type: Class
subclass of: virus
comment: avipoxvirus is a virus in the same family as smallpox , poxviridae .

calicivirus
type: Class
subclass of: rna virus
comment: calicivirus is an rna virus ( ) .

replication-competent virus
type: Class
subclass of: virus

adenovirus
type: Class
subclass of: dna virus
comment: adenovirus is probably the only dna virus that is a common cause of lrti in children 2 .

virusa virus
type: Class
subclass of: virus

human papillomavirus 18
type: Class
subclass of: human papillomavirus

colorado tick fever virus
type: Class
subclass of: reoviridae
comment: colorado tick fever virus is a subclass of reoviridae ( ) ) ) .

guttaviridae
type: Class
subclass of: virus
comment: guttaviridae is a family of virus that includes\ understands a single sort , guttavirus , that infects to bends sulfolobus .

iridovirus
type: Class
subclass of: strain dna virus
comment: iridovirus is a group of double strain dna virus , spherical , enveloped or non - enveloped and icosahedral .

vector
type: Class
subclass of: virus
comment: a vector is a virus or other agent that is used to deliver dna to a cell .

variola virus
type: Class
subclass of: double-stranded dna virus
comment: variola virus is a double-stranded dna virus in the family poxviridae and the genus orthopoxvirus .

trager duck spleen necrosis virus
type: Class
subclass of: virus

simian virus
type: Class
subclass of: virus

mengovirus
type: Class
subclass of: rna virus
comment: mengovirus is a small rna virus , approximately 27 mju in diameter ,1 2 contain - ing only rna and protein , according to the analyses of faulkner et al. on the .

mammary tumor virus
type: Class
subclass of: virus

human t-lymphotropic virus
type: Class
subclass of: t-lymphotropic virus

interferon-sensitive virus
type: Class
subclass of: virus

measles virus
type: Class
subclass of: rna virus
comment: measles virus is an rna virus ( ) that belongs to human cellular receptor of measles virus is the cd46 molecule , which is a.

capsid
type: Class
subclass of: virus
comment: a capsid is a virus 's protein coat .

sendai virus
type: Class
subclass of: enveloped virus
comment: sendai virus is an enveloped virus , which belongs to the .

orbivirus
type: Class
subclass of: reoviridae
comment: orbivirus is a subclass of reoviridae ( ) ) ) .

norwalk virus
type: Class
subclass of: diarrheal virus
comment: norwalk virus is one of the most important diarrheal viruses .

viroid
type: Class
subclass of: virus

torovirus
type: Class
subclass of: coronaviridae
comment: torovirus is a subclass of coronaviridae ( ) ) ) .

rudiviridae
type: Class
subclass of: virus
comment: rudiviridae is a family of virus that includes\ understands a single sort , the members of the family rudiviridae is similiares to those of poxviridae .

comovirus
type: Class
subclass of: virus
comment: comovirus is a new virus , partially character - ized , this comovirus is transmitted by chrysomelid beetles found both on beans and maize .

cytomegalovirus
type: Class
subclass of: dna virus
comment: cytomegalovirus is a dna virus , and humans are its only known host .

potyviridae
type: Class
subclass of: filamentous virus
comment: potyviridae is the only family of filamentous viruses where vpg was so far detected to be exposed in the virion .

murine pneumonia virus
type: Class
subclass of: virus

diarrheal virus
type: Class
subclass of: virus

african horse sickness virus
type: Class
subclass of: double-stranded rna virus
comment: african horse sickness virus is a double-stranded rna virus which causes a non - contagious , infectious arthropod-borne disease of equines and occasionally .

bi-segmented double-stranded rna virus
type: Class
subclass of: double-stranded rna virus

rubella virus
type: Class
subclass of: rna virus
comment: rubella virus is an rna virus that is the sole member of the rubivirus genus , within the togaviridae family ( ) .

sapovirus
type: Class
subclass of: positive-stranded rna virus
comment: sapovirus is a positive-stranded rna virus with a translational strategy based on processing of a polyprotein precursor by a chymotrypsin-like protease .

parainfluenza virus 3
type: Class
subclass of: virus
comment: parainfluenza virus 3 is one of the viruses known to cause respiratory infection .

alphavirus
type: Class
subclass of: sindbis virus
comment: alphavirus is sindbis virus , which is transmitted to hu - mans through mosquito bites .

vesicular stomatitis indiana virus
type: Class
subclass of: virus

lassa virus
type: Class
subclass of: arenavirus
comment: lassa virus is an arenavirus that causes hemorrhagic fever and is endemic to many countries in africa .

la crosse virus
type: Class
subclass of: bunyaviridae
comment: la crosse virus is a member of the bunyaviridae , a large family of viruses that includes the hantaviruses , which cause hantavirus pulmonary .

hepatitis b virus
type: Class
subclass of: hepadnavirus
comment: hepatitis b virus is an hepadnavirus -- '' hepa '' from '' hepatotrophic '' and '' dna '' because it is a dna virus the virus particle , ( ) consists of an outer lipid .

herpesvirus 3
type: Class
subclass of: herpesvirus

palyam virus
type: Class
subclass of: virus

human t-lymphotropic virus 1
type: Class
subclass of: retrovirus
comment: human t-lymphotropic virus 1 is a subclass of retrovirus ( ) ) ) .

hemorrhagic fever virus
type: Class
subclass of: virus

columbia sk virus
type: Class
subclass of: interferon-sensitive virus
comment: columbia sk virus is an interferon-sensitive virus , and the ability of these compounds to induce circulating interferon indirectly was demonstrated .

polydnaviridae
type: Class
subclass of: dna virus
comment: polydnaviridae is a unique family of dna viruses that are symbiotically the polydnaviridae is a family of double-st 256 randed ( ) dna .

muromegalovirus
type: Class
subclass of: betaherpesvirinae
comment: muromegalovirus is a subclass of betaherpesvirinae (

salmonella phage
type: Class
subclass of: phage

single-stranded phage
type: Class
subclass of: phage

mason-pfizer monkey virus
type: Class
subclass of: virus

avian myeloblastosis virus
type: Class
subclass of: avian leukosis virus
comment: avian myeloblastosis virus is another avian leukosis virus .

bacteriophage phi 6
type: Class
subclass of: enveloped dsrna virus
comment: bacteriophage phi 6 is an enveloped dsrna virus which infects the plant pathogenic pseudomonas syringae bacterium .

monopartite single-stranded positive sense rna plant virus
type: Class
subclass of: plant virus

porcine respiratory coronavirus
type: Class
subclass of: coronavirus

parvovirus b19
type: Class
subclass of: dna virus
comment: parvovirus b19 is a small dna virus that infects only humans .

simian virus 40
type: Class
subclass of: dna virus
comment: simian virus 40 is a small dna virus encoded by 5.2 kb of double-stranded dna .

simian virus 5
type: Class
subclass of: simian virus

classical swine fever virus
type: Class
subclass of: rna virus
comment: classical swine fever virus ( ) is a enveloped , single stranded positive rna virus of the genus pestivirus within the family flaviviridae 1 .

torque teno virus
type: Class
subclass of: single-stranded dna virus
comment: torque teno virus ( ) is a circular , single-stranded dna virus that chronically infects healthy individuals of all ages worldwide .

west nile virus
type: Class
subclass of: rna virus
comment: west nile virus ( ) is a single-stranded positive polarity enveloped rna virus and member of the flavivirus genus of the flaviviridae family .

foot-and-mouth disease virus
type: Class
subclass of: rna virus
comment: foot-and-mouth disease virus ( ) is a positive stranded rna virus .

hemorrhagic disease virus
type: Class
subclass of: virus

borna disease virus
type: Class
subclass of: rna virus
comment: borna disease virus is an rna virus , worldwide in distribution , that causes movement and behavior disturbances in warmblooded animal hosts ranging .

epsilonretrovirus
type: Class
subclass of: retrovirus
comment: epsilonretrovirus is a subclass of retrovirus (

herpesvirus 4
type: Class
subclass of: herpesvirus

tobacco mosaic virus
type: Class
subclass of: rna virus
comment: tobacco mosaic virus is an rna virus and the first virus to be discovered .

flavivirus
type: Class
subclass of: virus
comment: flavivirus is a family of viruses responsible for a wide range of diseases in humans and animals .

vesicular stomatitis new jersey virus
type: Class
subclass of: virus

minute virus of mouse
type: Class
subclass of: virus

parainfluenza virus 2
type: Class
subclass of: parainfluenza virus

gb virus c
type: Class
subclass of: flavivirus
comment: gb virus c is a novel flavivirus recently detected in hepatitis non a-e cases .

gb virus b
type: Class
subclass of: gb virus

poliovirus
type: Class
subclass of: rna virus
comment: poliovirus is a single stranded rna virus , a member of the family acute flaccid paralysis ( ) , which when attributable to poliovirus is known as paralytic .

dengue virus
type: Class
subclass of: enveloped virus
comment: dengue virus ( ) is an enveloped virus with a positive sense ssrna of about 11 kb coding a single open reading frame for three structural proteins , core ( ) , pre-membrane\ membrane ( ) and envelope ( ) , and seven non-structural proteins ( ) .

fibroma virus
type: Class
subclass of: virus

molluscum contagiosum virus
type: Class
subclass of: dna virus
comment: molluscum contagiosum virus is a dna virus in the poxviridae family that may cause extensive and voluminous lesions often resistant to topical .

picobirnavirus
type: Class
subclass of: rna virus
comment: picobirnavirus is an rna virus that is related with the production of diarrhea in immunocompromised patiens .

densovirus
type: Class
subclass of: parvoviridae
comment: densovirus is a subclass of parvoviridae (

bacteriophage n4
type: Class
subclass of: double-stranded dna virus
comment: bacteriophage n4 is a double-stranded dna virus spe - cific for escherichia coli k 12 strains .

vaccinia virus
type: Class
subclass of: poxviridae
comment: vaccinia virus ( ) is a member of the poxviridae , which constitute a large family of enveloped dna viruses and replicate entirely in the cytoplasm of the infected cells with a linear double-stranded dna genome of 130 -- 300 kilo base pairs 1 .

maize streak virus
type: Class
subclass of: virus

plum pox virus
type: Class
subclass of: potyvirus
comment: plum pox virus is a member of the potyvirus ( ) group , once established , plum pox virus is extremely difficult to eradicate .

polyomavirus
type: Class
subclass of: double-stranded dna virus
comment: polyomavirus is a double-stranded dna virus that includes jc , bk , and sv40 types .

herpesvirus 7
type: Class
subclass of: t-lymphotropic virus
comment: herpesvirus 7 is a t-lymphotropic virus and is relat - ed to , but significantly different from , human her - pesvirus 6 and human cytomegalovirus .

insect virus
type: Class
subclass of: virus

rous sarcoma virus
type: Class
subclass of: retrovirus
comment: rous sarcoma virus is a retrovirus and is the first oncovirus to have been rous was awarded the nobel prize for the significance of his discovery in .

nodaviridae
type: Class
subclass of: rna virus
comment: nodaviridae is a family of rna viruses .

phycodnaviridae
type: Class
subclass of: virus
comment: phycodnaviridae is a family of viruses that infect marine and freshwater eukaryotic algae .

murine hepatitis virus
type: Class
subclass of: hepatitis virus

bacteriophage t7
type: Class
subclass of: double-stranded dna bacteriophage
comment: bacteriophage t7 is a double-stranded dna bacteriophage that has attracted particular interest in studies of gene expression and regulation and of .

nonenveloped virus
type: Class
subclass of: virus

orthoreovirus
type: Class
subclass of: reoviridae
comment: orthoreovirus is a subclass of reoviridae ( ) ) ) .

sspe virus
type: Class
subclass of: virus

newcastle disease virus
type: Class
subclass of: paramyxovirus
comment: newcastle disease virus is a paramyxovirus that is contagious and fatal to avian fauna .

streptococcus phage
type: Class
subclass of: phage

double-stranded dna bacteriophage
type: Class
subclass of: bacteriophage

rinderpest virus
type: Class
subclass of: morbillivirus
comment: rinderpest virus is a morbillivirus and is the causative agent of a widespread and important disease of cattle .

arteritis virus
type: Class
subclass of: virus

h-1 parvovirus
type: Class
subclass of: parvovirus

strain dna virus
type: Class
subclass of: dna virus

roniviridae
type: Class
subclass of: virus
comment: roniviridae is a family of virus which a single sort is known , okavirus .

sandfly fever naples virus
type: Class
subclass of: virus

fowlpox virus
type: Class
subclass of: dna virus
comment: fowlpox virus is a dna virus that has a large genome and hence is considered to have ample room to carry foreign genes .

prevalent virus
type: Class
subclass of: virus

begomovirus
type: Class
subclass of: plant virus
comment: begomovirus is a plant virus mostly affecting dicotyledonous plants across the tropical and sub-tropical regions .

carlavirus
type: Class
subclass of: retrovirus
comment: carlavirus is a retrovirus that codifies a protein containing a zinc finger .

ross river virus
type: Class
subclass of: mosquito-borne arbovirus
comment: ross river virus is a common mosquito-borne arbovirus responsible for outbreaks of polyarthritic disease throughout australia .

oncolytic virus
type: Class
subclass of: virus

virus
type: Class